{"text_format":"3","workbook":"xlsx","n_sheets":2,"sheets":["新様式","ﾘｽﾄ"],"not_rendered":{"defined_names":1},"read":"whole","date_system":"1900"}

{"sheet":"新様式","index":0,"n_rows":32,"n_cols":11,"rows_kept":32,"merged":[[0,0,0,5],[8,2,8,5],[31,0,31,5]]}
["令和８年度　社員研修申込書      　Email:kenshu@syokuno.or.jp"]
[]
["企業名",null,"会員○・非会員×",{"$nulls":7},"○"]
["住所","〒",{"$nulls":8},"×"]
["電話番号",null,"当協会の会員・非会員の別をプルダウンより選択してください",{"$nulls":7},"不明"]
["FAX番号",null,"会員の別が分からない場合はお問い合わせください"]
["担当者役職名・氏名"]
["メールアドレス"]
["■研修番号(別紙リスト参照)、研修名、氏名、年齢を御記入ください。",null,"※フリガナは自動入力されますが、異なる場合は\n訂正をお願いいたします。"]
["研修番号\n(第１希望)","研　修　名","氏　名","フリガナ","年齢","第２希望\n番号"]
[null,{"$f":"IFERROR(VLOOKUP(A11,ﾘｽﾄ!$A$1:$J$70,4,0),\"\")","v":""},null,{"$f":"PHONETIC(C11)","v":""}]
[null,{"$f":"IFERROR(VLOOKUP(A12,ﾘｽﾄ!$A$1:$J$67,4,0),\"\")","v":""},null,{"$f":"PHONETIC(C12)","v":""}]
[null,{"$f":"IFERROR(VLOOKUP(A13,ﾘｽﾄ!$A$1:$J$67,4,0),\"\")","v":""},null,""]
[null,{"$f":"IFERROR(VLOOKUP(A14,ﾘｽﾄ!$A$1:$J$67,4,0),\"\")","v":""},null,""]
[null,{"$f":"IFERROR(VLOOKUP(A15,ﾘｽﾄ!$A$1:$J$67,4,0),\"\")","v":""},null,""]
[null,{"$f":"IFERROR(VLOOKUP(A16,ﾘｽﾄ!$A$1:$J$67,4,0),\"\")","v":""},null,""]
[null,{"$f":"IFERROR(VLOOKUP(A17,ﾘｽﾄ!$A$1:$J$67,4,0),\"\")","v":""},null,""]
[null,{"$f":"IFERROR(VLOOKUP(A18,ﾘｽﾄ!$A$1:$J$67,4,0),\"\")","v":""},null,""]
[null,{"$f":"IFERROR(VLOOKUP(A19,ﾘｽﾄ!$A$1:$J$67,4,0),\"\")","v":""},null,""]
[null,{"$f":"IFERROR(VLOOKUP(A20,ﾘｽﾄ!$A$1:$J$67,4,0),\"\")","v":""},null,""]
[null,{"$f":"IFERROR(VLOOKUP(A21,ﾘｽﾄ!$A$1:$J$67,4,0),\"\")","v":""},null,""]
[null,{"$f":"IFERROR(VLOOKUP(A22,ﾘｽﾄ!$A$1:$J$67,4,0),\"\")","v":""},null,""]
[null,{"$f":"IFERROR(VLOOKUP(A23,ﾘｽﾄ!$A$1:$J$67,4,0),\"\")","v":""},null,""]
[null,{"$f":"IFERROR(VLOOKUP(A24,ﾘｽﾄ!$A$1:$J$67,4,0),\"\")","v":""},null,""]
[null,{"$f":"IFERROR(VLOOKUP(A25,ﾘｽﾄ!$A$1:$J$67,4,0),\"\")","v":""},null,""]
[null,{"$f":"IFERROR(VLOOKUP(A26,ﾘｽﾄ!$A$1:$J$67,4,0),\"\")","v":""},null,""]
[]
["・同じ研修が別の日程で実施される場合は、第２希望の番号を記入してください。"]
["・社員研修は、グループワークで実施するので、他社の方との交流もできることから、複数でお申し込みいただく場合は、"]
["なるべく日程を分けていただきますようお願いします。"]
["・定員超過の場合は、受講日の調整をさせていただきます。"]
["・研修の受講者が特定できない場合でもお申し込みは可能です。氏名欄に会社名を記入してお申し込みの上、決まり次第ご連絡ください。"]

{"sheet":"ﾘｽﾄ","index":1,"n_rows":70,"n_cols":10,"rows_kept":70,"merged":[[0,0,1,0],[0,1,1,1],[0,2,1,2],[0,3,1,3],[0,4,1,4],[0,5,1,5],[0,6,1,6],[0,7,1,7],[0,8,1,8],[0,9,1,9],[2,4,5,4],[2,7,19,7],[2,9,3,9],[4,9,5,9],[6,4,17,4],[6,8,8,8],[6,9,19,9],[9,8,11,8],[12,8,14,8],[15,8,17,8],[18,4,19,4],[20,4,31,4],[20,7,31,7],[20,8,22,8],[20,9,31,9],[23,8,25,8],[26,8,28,8],[29,8,31,8],[32,4,43,4],[32,7,43,7],[32,8,34,8],[32,9,43,9],[35,8,37,8],[38,8,40,8],[41,8,43,8],[44,4,55,4],[44,7,55,7],[44,8,46,8],[44,9,55,9],[47,8,49,8],[50,8,52,8],[53,8,55,8],[56,7,65,7],[56,9,57,9],[58,9,59,9],[63,9,64,9],[66,7,69,7],[67,9,68,9]]}
["番号","番号","研　　修　　名","研修名(表示用)","対　象　者　","日(調整中)","日程(表示用)","時間","定員\n(目安)","講師名"]
[]
[1,1,"新入社員研修１【基礎２日間編】",{"$f":"C3&G3","v":"新入社員研修１【基礎２日間編】4.6～7"},"新入社員\n\n（目安）\n入社1年目～３年目","4月3日(木)\n　～4日(金)","4.6～7","10:00～16:00",36,"節政 沙弥香"]
[2,2,"新入社員研修１【基礎２日間編】",{"$f":"C4&G4","v":"新入社員研修１【基礎２日間編】4.9～10"},null,"4月10日(木)\n　～11日(金)","4.9～10",null,36]
[3,3,"新入社員研修２【基礎1日集中講座】","新入社員研修２【基礎1日集中講座】4.14",null,"2025-04-14",4.14,null,20,"長峰 ヒロ子"]
[4,4,"新入社員研修２【ビジネスマナー実践編】","新入社員研修２【ビジネスマナー実践編】5.18",null,"2025-05-19",5.18,null,20]
[5,5,"新入社員研修３【スタートアップ編：働く力】","新入社員研修３【スタートアップ編：働く力】4.21","新入社員\n\n（目安）\n入社１年目～３年目（１０代、２０代）","2025-04-22",4.21,null,20,"籾田 弥生"]
[6,6,"新入社員研修３【スタートアップ編：働く力】","新入社員研修３【スタートアップ編：働く力】5.13",null,"2025-04-23",5.13]
[7,"7★","★新入社員研修３【スタートアップ編：働く力】","★新入社員研修３【スタートアップ編：働く力】★4.23",null,"2025-04-25","★4.23"]
[8,8,"新入社員研修４【スタートアップ編：メンタルヘルス】 ","新入社員研修４【スタートアップ編：メンタルヘルス】 6.23",null,"2025-06-24",6.23,null,20]
[9,9,"新入社員研修４【スタートアップ編：メンタルヘルス】","新入社員研修４【スタートアップ編：メンタルヘルス】6.24",null,"2025-06-25",6.24]
[10,"10★","★新入社員研修４【スタートアップ編：メンタルヘルス】","★新入社員研修４【スタートアップ編：メンタルヘルス】★6.26",null,"2025-06-27","★6.26"]
[11,11,"新入社員研修５【フォローアップ編】","新入社員研修５【フォローアップ編】10.20",null,"2025-10-28","10.20",null,20]
[12,12,"新入社員研修５【フォローアップ編】","新入社員研修５【フォローアップ編】10.21",null,"2025-10-29","10.21"]
[13,"13★","★新入社員研修５【フォローアップ編】","★新入社員研修５【フォローアップ編】★10.27",null,"2025-10-31","★10.27"]
[14,14,"新入社員研修６【ステップアップ編】","新入社員研修６【ステップアップ編】R9.1.13",null,"2026-01-14","R9.1.13",null,20]
[15,15,"新入社員研修６【ステップアップ編】","新入社員研修６【ステップアップ編】R9.1.14",null,"2026-01-15","R9.1.14"]
[16,"16★","★新入社員研修６【ステップアップ編】","★新入社員研修６【ステップアップ編】★R9.1.19",null,"2026-01-20","★R9.1.19"]
[17,17,"新入社員研修７【中途採用者編】 ","新入社員研修７【中途採用者編】 5.27","中途採用の新入社員（30代、40代）","2025-05-27","5.27",null,20]
[18,18,"新入社員研修７【中途採用者編】 ","新入社員研修７【中途採用者編】 11.20",null,"2025-11-26","11.20",null,20]
[19,19,"中堅社員研修１ 【身に着けたい知識やスキル】","中堅社員研修１ 【身に着けたい知識やスキル】5.14","一般職で監督指導職を支える中堅社員など","2025-05-15","5.14","13:30～16:30",20,"島原 竜一"]
[20,"20★","★中堅社員研修１ 【身に着けたい知識やスキル】","★中堅社員研修１ 【身に着けたい知識やスキル】★5.15",null,"2025-05-16","★5.15"]
[21,21,"中堅社員研修１ 【身に着けたい知識やスキル】","中堅社員研修１ 【身に着けたい知識やスキル】9.11",null,"2025-09-11","9.11"]
[22,22,"中堅社員研修２ 【後輩の指導と育成】","中堅社員研修２ 【後輩の指導と育成】6.11",null,"2025-06-12","6.11",null,20]
[23,"23★","★中堅社員研修２ 【後輩の指導と育成】","★中堅社員研修２ 【後輩の指導と育成】★6.12",null,"2025-06-13","★6.12"]
[24,24,"中堅社員研修２ 【後輩の指導と育成】","中堅社員研修２ 【後輩の指導と育成】10.9",null,"2025-10-09","10.9"]
[25,25,"中堅社員研修３【求められる役割と果たすべき責任】","中堅社員研修３【求められる役割と果たすべき責任】7.9",null,"2025-07-08","7.9",null,20]
[26,"26★","★中堅社員研修３【求められる役割と果たすべき責任】","★中堅社員研修３【求められる役割と果たすべき責任】★7.10",null,"2025-07-09","★7.10"]
[27,27,"中堅社員研修３【求められる役割と果たすべき責任】","中堅社員研修３【求められる役割と果たすべき責任】11.13",null,"2025-11-06","11.13"]
[28,28,"中堅社員研修４【ロールモデルを目指す】","中堅社員研修４【ロールモデルを目指す】8.6",null,"2025-08-07","8.6",null,20]
[29,"29★","★中堅社員研修４【【ロールモデルを目指す】","★中堅社員研修４【【ロールモデルを目指す】★8.7",null,"2025-08-08","★8.7"]
[30,30,"中堅社員研修４【【ロールモデルを目指す】","中堅社員研修４【【ロールモデルを目指す】12.11",null,"2025-12-11","12.11"]
[31,31,"主任・係長クラス研修１【コミュニケーション編】","主任・係長クラス研修１【コミュニケーション編】5.22","主任、係長クラスの\n小単位の指導職の方など","2025-05-21","5.22","13:30～16:30",20,"齋藤 幸子"]
[32,"32★","★主任・係長クラス研修１【コミュニケーション編】","★主任・係長クラス研修１【コミュニケーション編】★5.26",null,"2025-05-22","★5.26"]
[33,33,"主任・係長クラス研修１【コミュニケーション編】","主任・係長クラス研修１【コミュニケーション編】9.17",null,"2025-09-17","9.17"]
[34,34,"主任・係長クラス研修２【モチベーション編】","主任・係長クラス研修２【モチベーション編】6.16",null,"2025-06-17","6.16",null,20]
[35,"35★","★主任・係長クラス研修２【モチベーション編】","★主任・係長クラス研修２【モチベーション編】★6.19",null,"2025-06-18","★6.19"]
[36,36,"主任・係長クラス研修２【モチベーション編】","主任・係長クラス研修２【モチベーション編】10.15",null,"2025-10-21","10.15"]
[37,37,"主任・係長クラス研修３【リーダーシップ編】","主任・係長クラス研修３【リーダーシップ編】7.14",null,"2025-07-15","7.14",null,20]
[38,"38★","★主任・係長クラス研修３【リーダーシップ編】","★主任・係長クラス研修３【リーダーシップ編】★7.15",null,"2025-07-16","★7.15"]
[39,39,"主任・係長クラス研修３【リーダーシップ編】","主任・係長クラス研修３【リーダーシップ編】11.18",null,"2025-11-18","11.18"]
[40,40,"主任・係長クラス研修４【キャリアビジョン編】","主任・係長クラス研修４【キャリアビジョン編】8.19",null,"2025-08-19","8.19",null,20]
[41,"41★","★主任・係長クラス研修４【キャリアビジョン編】","★主任・係長クラス研修４【キャリアビジョン編】★8.20",null,"2025-08-20","★8.20"]
[42,42,"主任・係長クラス研修４【キャリアビジョン編】","主任・係長クラス研修４【キャリアビジョン編】12.17",null,"2025-12-16","12.17"]
[43,43,"管理監督者研修１【管理監督者の役割と責任】","管理監督者研修１【管理監督者の役割と責任】5.12","監督職・管理職の方など","2025-05-13","5.12","13:30～16:30",20,"黒木 陽子"]
[44,"44★","★管理監督者研修１【管理監督者の役割と責任】","★管理監督者研修１【管理監督者の役割と責任】★5.19",null,"2025-05-14","★5.19"]
[45,45,"管理監督者研修１【管理監督者の役割と責任】","管理監督者研修１【管理監督者の役割と責任】9.9",null,"2025-09-10","9.9"]
[46,46,"管理監督者研修２【チームワークで目標達成・成長サポート】","管理監督者研修２【チームワークで目標達成・成長サポート】6.3",null,"2025-06-04","6.3",null,20]
[47,"47★","★管理監督者研修２【チームワークで目標達成・成長サポート】","★管理監督者研修２【チームワークで目標達成・成長サポート】★6.10",null,"2025-06-05","★6.10"]
[48,48,"管理監督者研修２【チームワークで目標達成・成長サポート】","管理監督者研修２【チームワークで目標達成・成長サポート】10.7",null,"2025-10-22","10.7"]
[49,49,"管理監督者研修３【管理監督者としての基本対応能力UP】","管理監督者研修３【管理監督者としての基本対応能力UP】7.8",null,"2025-07-01","7.8",null,20]
[50,"50★","★管理監督者研修３【管理監督者としての基本対応能力UP】","★管理監督者研修３【管理監督者としての基本対応能力UP】★7.16",null,"2025-07-02","★7.16"]
[51,51,"管理監督者研修３【管理監督者としての基本対応能力UP】","管理監督者研修３【管理監督者としての基本対応能力UP】11.11",null,"2025-11-11","11.11"]
[52,52,"管理監督者研修４【環境を変化させる力をつける】","管理監督者研修４【環境を変化させる力をつける】8.5",null,"2025-08-06","8.5",null,20]
[53,"53★","★管理監督者研修４【環境を変化させる力をつける】","★管理監督者研修４【環境を変化させる力をつける】★8.24",null,"2025-08-21","★8.24"]
[54,54,"管理監督者研修４【環境を変化させる力をつける】","管理監督者研修４【環境を変化させる力をつける】12.2",null,"2025-12-17","12.2"]
[55,55,"労働基準法研修","労働基準法研修10.16","労務・人事担当者・管理職者","2025-10-14","10.16","13:30～16:30",20,"下薗 浩二"]
[56,56,"新しい時代の安全・衛生管理手法","新しい時代の安全・衛生管理手法9.25","経営層・安全管理者・管理職・現場管理者他","2025-09-09","9.25",null,20]
[57,57,"ストレスマネジメント研修","ストレスマネジメント研修9.7","一般（どなたでも）","2025-09-19","9.7",null,20,"有馬 和江"]
[58,58,"職場のハラスメント防止研修","職場のハラスメント防止研修9.28","中堅社員～管理職","2025-10-17","9.28",null,20]
[59,59,"営業担当者研修","営業担当者研修10.22","営業担当者（営業・販売担当者）","2025-10-16","10.22",null,20,"新名 一史"]
[60,60,"コンプライアンス＆リスクマネジメント研修","コンプライアンス＆リスクマネジメント研修11.25","一般職～管理職","2025-11-12","11.25",null,20,"吉田 信夫"]
[61,61,"若手社員研修【必要な知識・スキル・思考】","若手社員研修【必要な知識・スキル・思考】9.18","若手社員（入社２年目～３年目）","2025-10-10","9.18",null,20,"島原 竜一"]
[62,62,"モノゴトの捉え方研修","モノゴトの捉え方研修11.4","考え方を前向きにしたい方、\nモチベーションを上げたい方","2025-05-20","11.4",null,20,"黒木 陽子"]
[63,63,"採用担当者研修〈採用から定着編〉","採用担当者研修〈採用から定着編〉8.18","新規採用者（入社１年目の方）\n安全衛生教育が必要な方","2025-04-15","8.18",null,20]
[64,64,"アンコンシャス・バイアス研修","アンコンシャス・バイアス研修8.27","育成担当者、部下育成に興味がある方","2025-06-11","8.27",null,20,"齋藤 幸子"]
[65,65,"新規採用者の安全衛生研修","新規採用者の安全衛生研修4.17","４０～５０代のベテラン社員","2025-09-02","4.17","10:00～16:00",20,"下薗 浩二"]
[66,null,"育成担当者研修〈OJT育成編〉","育成担当者研修〈OJT育成編〉9.29",null,null,"9.29",null,20,"黒木 陽子"]
[67,null,"ベテランズ研修【ベテランの経験を活かす】",{"$f":"C69&G69","v":"ベテランズ研修【ベテランの経験を活かす】10.6"},null,null,"10.6",null,20]
[68,null,"接遇マナー研修【接遇スキルアップ・クレーム対応研修】","接遇マナー研修【接遇スキルアップ・クレーム対応研修】9.10",null,null,"9.10",null,20,"節政 沙弥香"]